{"text_format":"2","workbook":"xlsx","n_sheets":13,"sheets":["Indice","B-1PESEM","B-2 PEI","B-3 FISICO","B-4 FINANCIERO","B-5 TAREAS","B-6 ARTIC TAREAS PLANES","Hoja1","Hoja2","Hoja3","Flujo Form","Flujo Eval","Hoja4"],"not_rendered":{"charts":0,"images":0,"macros":0,"external_links":0,"defined_names":14,"comments":2,"pivot_tables":0},"unopened":[],"bounds":{"document_bytes":16777216,"sheet_cells":100000,"run_cost":"one","rows_first":2000,"rows_last":500,"rows_between":2000,"halvings":0,"cell_chars":16384,"cell_head_chars":4096},"cells_cut":0,"cells_raw":0,"read":"whole","date_system":"1900"}

{"sheet":"Indice","index":0,"n_rows":5,"n_cols":2,"rows_kept":5,"cut":false,"hidden":false,"merged":[]}
["Matriz de Articulación de Planes","ANEXO B-1"]
["Matriz del Pla Estratégico Institucional","ANEXO B-2"]
["Matriz de Articulación del POI con Metas Física a nivel de Actividad","ANEXO B-3"]
["Matriz de Articulación del POI con Metas Financiaras a nivel de Actividad","ANEXO B-4"]
["Matriz de Articulación del POI con Metas Física y Financieras a nivel de Tareas","ANEXO B-5"]

{"sheet":"B-1PESEM","index":1,"n_rows":8,"n_cols":9,"rows_kept":8,"cut":false,"hidden":false,"merged":[[2,6,2,8],[0,0,0,8],[4,0,7,0],[4,1,7,1],[4,2,7,2],[6,5,7,5],[4,3,5,3],[4,4,5,4],[4,5,5,5],[2,0,2,2],[2,3,2,5],[1,0,1,8]]}
["Anexo B-1"]
["Matriz de Articulación de Planes"]
["Objetivo Estratégico Sectorial",null,null," Acción Estratégica Sectorial",null,null," Objetivo Estratégico Institucional"]
["Codigo","Enunciado","Indicador","Codigo","Enunciado","Indicador","Codigo","Enunciado","Indicador"]
["OES.02","Ampliar la cobertura de aseguramiento para la protección en salud de la población","Porcentaje de\nPoblación\nafiliada a un\nseguro de\nsalud","AES.02.01","Incrementar la cobertura de aseguramiento público de la población","Porcentaje de población afiliada al SIS ","OEI 1","Incrementar la cobertura de la población objetivo del SIS.","Porcentaje de asegurados al SIS que presentaron un reclamo por limitaciones de la cobertura del seguro."]
[{"$nulls":6},"OEI 2","Reducir los riesgos técnicos y financieros de la prestación de planes y productos para el asegurado ","Porcentaje de prestaciones de salud reportadas que resultaron ser financiados por el SIS"]
[null,null,null,"AES.02.02","Modernizar la gestión de los servicios de salud","Porcentaje de personas que acuden a establecimientos de salud y reciben servicios de salud ","OEI 3","Mejorar la gestión del financiamiento de las prestaciones aprobadas para la atención del asegurado a","Porcentaje de producción financiada con recursos administrados por el SIS respecto a la producción total valorizada."]
[null,null,null,"AES.02.03","Generar capacidades para el desarrollo e, implantación de tecnologías, investigacíón e información sanitaria.",null,"OEI 4","Mejorar la eficacia y eficiencia de los procesos de gestión institucional.","Porcentaje de procesos priorizados certificados en el marco del Sistema de Gestión de la Calidad."]

{"sheet":"B-2 PEI","index":2,"n_rows":18,"n_cols":14,"rows_kept":18,"cut":false,"hidden":false,"merged":[[0,0,0,13],[1,6,1,7],[1,8,1,9],[1,10,1,12],[1,13,2,13],[1,2,2,2],[1,3,2,3],[1,4,2,4],[1,5,2,5],[1,0,1,1]]}
["Anexo B-2\nMatriz del Plan Estratégico Institucional"]
["OEI/AEI",null,"Nombre del Indicador","Formula del Indicador","Fuente de Datos","Tipo de Indciador","Linea Base",null,"Valor actual",null,"Logros Esperados",null,null,"Responsable"]
["Codigo","Enunciado",{"$nulls":4},"Año","Valor","Año","Valor",2017,2018,2019]
["OEI 1","Incrementar la cobertura de la población objetivo del SIS.","Porcentaje de asegurados al SIS que presentaron un reclamo por limitaciones de la cobertura del seguro.","N° de reclamos relacionados a cobertura de seguro / Numero total de reclamos presentados.","Base de datos de las GMR y la GA.","Resultado",2015,"ND",2016,0.14799999999999999,0.15,0.12,0.1,"G A"]
["AEI 1.1","Afiliación al SIS incrementada en la población objetivo.","Porcentaje de población objetivo asegurada al SIS","N° de personas afiliadas al SIS / Total de población objetivo del SIS","Registro de afiliados al AUS. Base de datos SIS.","Producto",2015,0.76,2016,0.78,0.8,0.82,0.84,"G A"]
["AEI 1.2","Mecanismos de protección de derechos optimizados","Porcentaje de asegurados que consideran resuelta su solicitud de atención.","N° de asegurados encuestados que consideran resuelta su solicitud / Total de encuestados que realizan una solicitud.","Encuesta Nacional del asegurados en OAAs.","Producto",2015,"ND",2016,"ND",0.85,0.9,0.95,"G A"]
["OEI 2","Reducir los riesgos técnicos y financieros de la prestación de planes y productos para el asegurado ","Porcentaje de prestaciones de salud reportadas que resultaron ser financiados por el SIS","Prestaciones de salud financiadas por el SIS / Total deprestaciones de salud reportadas al SIS","Modulo SME, PCPP, BD SIASIS","Producto",2016,"ND",2016,"ND",0.97499999999999998,0.95499999999999996,0.92,"GNF"]
["AEI 2.1","Control técnico y financiero de las prestaciones médicas valorizadas incrementado a los establecimientos de salud.","Porcentaje de prestaciones médicas valorizadas con auditoria médica y financiera","N° de prest. médicas valorizadas con auditoria méd/financ / Total de prestaciones medicas valorizadas.","BD SIS","Producto",2016,"ND",2017,"ND",0.05,0.1,0.2,"GNF"]
["AEI 2.2","Auditoria médica y financiera optimizada a los establecimientos de salud.","Porcentaje de prestaciones médicas auditadas con observaciones","N° de prest. médicas auditadas con PCPP y Control recurrente con observación / Total de prestaciones medicas auditadas.","Base de datos SIS.","Producción",2016,"ND",2017,"ND",0.5,0.45,0.4,"GREP"]
["OEI 3","Mejorar la gestión del financiamiento de las prestaciones aprobadas para la atención del asegurado a","Porcentaje de producción financiada con recursos administrados por el SIS respecto a la producción total valorizada.","Producción financiada por recursos auditados por el ISIS / Producción total valorizada.","DB SIS, Informe GNF","Producto",2016,"ND",2017,"ND",0.8,0.9,1,"GNF"]
["AEI 3.1","Financiamiento del SIS incrementado por Recursos Directamente Recaudados.","Porcentaje de recursos administrados por el SIS que han sido recaudados directamente.","Recursos Directamente Recaudados / Recursos Administrados por el SIS","Base de datos del MEF. Reporte de tesorería del SIS.","Producto",2015,"ND",2016,3.0000000000000001E-3,0.01,0.04,0.06,"GNF"]
["AEI 3.2","Recursos del SIS transferidos orientados al financiamiento de reposición de medicamentos e insumos.","Porcentaje de los recursos transferidos por el SIS destinados a la reposición de medicamentos e insumos.","Recursos transferidos para reposición / Total de recursos transferidos.","BD SIS","Producto",2015,"ND",2016,0.59199999999999997,0.75,0.77,0.8,"GNF"]
["AEI 3.3","Mecanismos de compra de servicios de salud optimizados para la atención del asegurado al SIS.","Porcentaje de población SIS adscrita a los establecimientos de salud atendidos en atención primaria.","N° de atendidos en Atención Primaria / Total de asegurados SIS.","Base de datos del SIS","Producción",2015,"ND",2016,"ND",0.45,0.5,0.6,"GREP"]
["OEI 4","Mejorar la eficacia y eficiencia de los procesos de gestión institucional.","Porcentaje de procesos priorizados certificados en el marco del Sistema de Gestión de la Calidad.","N° de procesos priorizados con certificación ISO 9001 / Total de procesos priorizados","Certificación ISO 9001:2015","Resultado",2015,0,2016,0,0.3,0.7,0.9,"OGPPDO"]
["AEI 4.1","Fortalecer la organización orientado al desarrollo de las funciones de un asegurador público eficiente, eficaz y con un enfoque de procesos.","Porcentaje de procesos priorizados de nivel 3 implementados.","N° de proceso nivel 3 identificados y aprobados / Total de procesos identificados nivel 3.","Documentos resolutivos","Producto",2015,0,2016,0,0.5,0.8,0.9,"OGPPDO"]
{"$rows_left_out":4}
{"sheet":"B-3 FISICO","index":3,"n_rows":701,"n_cols":19,"rows_kept":701,"cut":false,"hidden":false,"merged":[[0,0,0,18],[1,11,1,18],[2,11,2,18],[4,3,5,3],[4,4,5,4],[4,5,5,5],[4,6,4,17],[4,18,5,18],[4,0,5,2]]}
["ANEXO B-3  Matriz de Articulación del POI con Metas Física a nivel de Actividad"]
["Periodo PEI : 2017 - 2019",{"$nulls":10},"Nivel de Gobierno : E - GOBIERNO NACIONAL"]
["Sector : 11 - SALUD",{"$nulls":10},"Pliego : 135 - SEGURO INTEGRAL DE SALUD"]
["Unidad Ejecutora : 001091 - SEGURO INTEGRAL DE SALUD"]
["OEI/AEI/CC/ COD_AO",null,null,"DESCRIPCIÓN DE ACTIVIDAD OPERATIVA","U.M.","S/.","PROGRAMACION",{"$nulls":11},"Meta Fisica Anual"]
[{"$nulls":6},"ENE","FEB","MAR","ABR","MAY","JUN","JUL","AGO","SET","OCT","NOV","DIC"]
[null,"01.01 - JEFATURA"]
["OEI.04 Mejorar la eficacia y eficiencia de los procesos de gestión instituciona"]
[null,"AEI.04.01 Fortalecer la organización orientándola al desarrollo de las funciones de un asegurador público eficiente, eficaz y con enfoque de procesos."]
[null,null,"18AO110921692","Efectuar acciones diversas de gestión institucional","INFORME",{"$f":"+SUM('B-5 TAREAS'!E10:E13)","v":236708},{"$f":"+SUM('B-5 TAREAS'!F10:F13)","v":1},{"$f":"+SUM('B-5 TAREAS'!G10:G13)","v":2},{"$f":"+SUM('B-5 TAREAS'!H10:H13)","v":3},{"$f":"+SUM('B-5 TAREAS'!I10:I13)","v":1},{"$f":"+SUM('B-5 TAREAS'!J10:J13)","v":1},{"$f":"+SUM('B-5 TAREAS'!K10:K13)","v":3},{"$f":"+SUM('B-5 TAREAS'!L10:L13)","v":1},{"$f":"+SUM('B-5 TAREAS'!M10:M13)","v":1},{"$f":"+SUM('B-5 TAREAS'!N10:N13)","v":3},{"$f":"+SUM('B-5 TAREAS'!O10:O13)","v":1},{"$f":"+SUM('B-5 TAREAS'!P10:P13)","v":1},{"$f":"+SUM('B-5 TAREAS'!Q10:Q13)","v":5},{"$f":"SUM(G10:R10)","v":23}]
[null,"01.02.01 - SECRETARIA GENERAL"]
["OEI.04 Mejorar la eficacia y eficiencia de los procesos de gestión instituciona"]
[null,"AEI.04.01 Fortalecer la organización orientándola al desarrollo de las funciones de un asegurador público eficiente, eficaz y con enfoque de procesos."]
[null,null,"18AO110920381","Desarrollar acciones diversas de gestión","INFORME",{"$f":"+SUM('B-5 TAREAS'!E17:E21)","v":971697},{"$f":"+SUM('B-5 TAREAS'!F17:F21)","v":3576},{"$f":"+SUM('B-5 TAREAS'!G17:G21)","v":3576},{"$f":"+SUM('B-5 TAREAS'!H17:H21)","v":3578},{"$f":"+SUM('B-5 TAREAS'!I17:I21)","v":3576},{"$f":"+SUM('B-5 TAREAS'!J17:J21)","v":3577},{"$f":"+SUM('B-5 TAREAS'!K17:K21)","v":3578},{"$f":"+SUM('B-5 TAREAS'!L17:L21)","v":3577},{"$f":"+SUM('B-5 TAREAS'!M17:M21)","v":3576},{"$f":"+SUM('B-5 TAREAS'!N17:N21)","v":3578},{"$f":"+SUM('B-5 TAREAS'!O17:O21)","v":6502},{"$f":"+SUM('B-5 TAREAS'!P17:P21)","v":6502},{"$f":"+SUM('B-5 TAREAS'!Q17:Q21)","v":6502},{"$f":"SUM(G14:R14)","v":51698}]
[null,null,"18AO111149643","Hacer seguimiento a la ejecución del Plan de Integridad y Lucha anti corrupción","INFORME",{"$f":"+SUM('B-5 TAREAS'!E22:E31)","v":12960},{"$f":"+SUM('B-5 TAREAS'!F22:F31)","v":0},{"$f":"+SUM('B-5 TAREAS'!G22:G31)","v":0},{"$f":"+SUM('B-5 TAREAS'!H22:H31)","v":0},{"$f":"+SUM('B-5 TAREAS'!I22:I31)","v":0},{"$f":"+SUM('B-5 TAREAS'!J22:J31)","v":0},{"$f":"+SUM('B-5 TAREAS'!K22:K31)","v":0},{"$f":"+SUM('B-5 TAREAS'!L22:L31)","v":0},{"$f":"+SUM('B-5 TAREAS'!M22:M31)","v":0},{"$f":"+SUM('B-5 TAREAS'!N22:N31)","v":0},{"$f":"+SUM('B-5 TAREAS'!O22:O31)","v":1},{"$f":"+SUM('B-5 TAREAS'!P22:P31)","v":5},{"$f":"+SUM('B-5 TAREAS'!Q22:Q31)","v":10},{"$f":"SUM(G15:R15)","v":16}]
{"$rows_left_out":687}
{"sheet":"B-4 FINANCIERO","index":4,"n_rows":703,"n_cols":11,"rows_kept":703,"cut":false,"hidden":false,"merged":[[5,3,6,3],[1,0,1,10],[2,6,2,10],[3,6,3,10],[5,10,6,10],[5,5,6,5],[5,4,6,4],[5,6,5,9],[5,0,6,2]]}
[]
["ANEXO B-4 Matriz de Articulación del POI con Metas Financiaras a nivel de Actividad"]
[null,"Periodo PEI : 2017 - 2019",{"$nulls":4},"Nivel de Gobierno : E - GOBIERNO NACIONAL"]
[null,"Sector : 11 - SALUD",{"$nulls":4},"Pliego : 135 - SEGURO INTEGRAL DE SALUD"]
[null,"Unidad Ejecutora : 001091 - SEGURO INTEGRAL DE SALUD"]
["OEI/AEI/CC/ COD_AO",null,null,"ACTIVIDAD OPERATIVA","U.M.","Meta Física","PROGRAMACION",null,null,null,"Meta Financ.\nAnual"]
[{"$nulls":6},"1 T","2T","3T","4T"]
[null,"01.01 - JEFATURA"]
["OEI.04 Mejorar la eficacia y eficiencia de los procesos de gestión instituciona"]
[null,"AEI.04.01 Fortalecer la organización orientándola al desarrollo de las funciones de un asegurador público eficiente, eficaz y con enfoque de procesos."]
[null,null,"18AO110921692","Efectuar acciones diversas de gestión institucional","INFORME",{"$f":"+VLOOKUP(C11,'B-3 FISICO'!C10:S701,17,0)","v":23},27346.43,40677.879999999997,103770.22,64913.47,{"$f":"+VLOOKUP(C11,'B-3 FISICO'!$C$10:$F$701,4,0)","v":236708}]
[null,"01.02.01 - SECRETARIA GENERAL"]
["OEI.04 Mejorar la eficacia y eficiencia de los procesos de gestión instituciona"]
[null,"AEI.04.01 Fortalecer la organización orientándola al desarrollo de las funciones de un asegurador público eficiente, eficaz y con enfoque de procesos."]
[null,null,"18AO110920381","Desarrollar acciones diversas de gestión","INFORME",{"$f":"+VLOOKUP(C15,'B-3 FISICO'!C14:S705,17,0)","v":51698},86092,199962,164168,521475,{"$f":"+VLOOKUP(C15,'B-3 FISICO'!$C$10:$F$701,4,0)","v":971697}]
{"$rows_left_out":689}
{"sheet":"B-5 TAREAS","index":5,"n_rows":1605,"n_cols":18,"rows_kept":1605,"cut":false,"hidden":false,"merged":[[9,2,12,2],[1606,1,1606,5],[1606,6,1606,17],[1605,2,1605,3],[1605,5,1605,6],[4,3,5,3],[4,4,5,4],[4,17,5,17],[0,0,0,17],[2,9,2,17],[3,9,3,17],[4,5,4,16],[4,0,5,2]]}
["ANEXO B-5   Matriz de Articulación del POI con Metas Física y Financieras a nivel de Tareas"]
["Periodo PEI : 2017 - 2019"]
["Sector : 11 - SALUD",{"$nulls":8},"Nivel de Gobierno : E - GOBIERNO NACIONAL"]
["Unidad Ejecutora : 001091 - SEGURO INTEGRAL DE SALUD",{"$nulls":8},"Pliego : 135 - SEGURO INTEGRAL DE SALUD"]
["OEI/AEI/CC/ COD_AO",null,null,"DESCRIPCIÓN DE TAREAS","S/.","PROGRAMACION",{"$nulls":11},"TT"]
[{"$nulls":5},1,2,3,4,5,6,7,8,9,10,11,12]
[null,"01.01 - JEFATURA"]
["OEI.04"]
[null,"AEI.04.01"]
[null,null,"18AO110921692","Efectuar acciones diversas de gestión institucional",79945.123364127852,{"$nulls":5},1,null,null,1,null,null,1,{"$f":"SUM(F10:Q10)","v":3}]
[null,null,null,"Elaborar y ejecutar el Plan de Control Interno",69015.102921453145,null,null,1,null,null,1,null,null,1,null,null,2,{"$f":"SUM(F11:Q11)","v":5}]
[null,null,null,"Conducción y orientación superior",69015.102921453145,null,1,1,1,1,1,1,1,1,1,1,1,{"$f":"SUM(F12:Q12)","v":11}]
[null,null,null,"Efectuar acciones diversas de apoyo",18732.670792965855,1,1,1,{"$nulls":8},1,{"$f":"SUM(F13:Q13)","v":4}]
[null,"01.02.01 - SECRETARIA GENERAL"]
["OEI.04"]
{"$rows_left_out":1591}
{"sheet":"B-6 ARTIC TAREAS PLANES","index":6,"n_rows":75,"n_cols":9,"rows_kept":75,"cut":false,"hidden":true,"merged":[[69,0,70,0],[69,1,70,1],[71,0,74,0],[72,1,74,1],[49,0,65,0],[49,1,65,1],[66,0,68,0],[66,1,68,1],[42,0,45,0],[42,1,45,1],[46,0,48,0],[46,1,48,1],[21,0,33,0],[21,1,29,1],[30,1,33,1],[34,0,41,0],[34,1,41,1],[17,0,20,0],[17,1,20,1],[0,0,0,8],[5,1,14,1],[15,1,16,1],[5,0,16,0]]}
["ANEXO B-6   Matriz de Articulación del POI con Planes Específicos"]
["Periodo PEI : 2017 - 2019"]
["Sector : 11 - SALUD",{"$nulls":7},"Nivel de Gobierno : E - GOBIERNO NACIONAL"]
["Unidad Ejecutora : 001091 - SEGURO INTEGRAL DE SALUD",{"$nulls":7},"Pliego : 135 - SEGURO INTEGRAL DE SALUD"]
["Centro de Costo","Código","DESCRIPCIÓN DE TAREAS","P. Integridad","P. Informático","P. Comunicac.","P Desar. Pers.","P. A. Contrat","P. Archivo"]
["01.02.01","18AO111149643","Gestionar campañas sobre el Código de Ética de la Función Pública","x"]
[null,null,"Coordinar la elaboración del Plan de Trabajo para el cierre de brechas ","x"]
[null,null,"Promover la implementación de instrumentos que promueven la integridad pública","x"]
[null,null,"Realizar seguimiento y monitoreo de casos presentados a través del Libro de Reclamaciones","x"]
[null,null,"Realizar coordinaciones para gestionar la designación del Procurador Publico para la Entidad","x"]
[null,null,"Realizar una encuesta sobre como siente el servidor  el clima etico al interior de la Entidad ","x"]
[null,null,"Promover la transparencia, ética e integridad pública en los servidores de la entidad. ","x"]
[null,null,"Realizar visitas inopinadas a las UDR ","x"]
[null,null,"Fortalecer a la Oficina de Integridad Institucional","x"]
[null,null,"Elaborar instrumentos normativos asociado a riesgos de corrupción identificados en procesos existentes.","x"]
{"$rows_left_out":61}
{"sheet":"Hoja1","index":7,"n_rows":90,"n_cols":6,"rows_kept":90,"cut":false,"hidden":true,"merged":[]}
["a",null,"g","f","h","TELEF"]
[1049133,null,"ANA MARÍA BARRUTIA BARRETO","ABARRUTIA@SIS.GOB.PE",3.01,20187254]
[1091171,null,"VICTOR VALLEJO CUTTI","VVALLEJO@SIS.GOB.PE",2.0099999999999998,20187254]
[1091174,null,"ENRIQUE BARBOZA HUAPALLA","EBARBOZA@SIS.GOB.PE",3.02,20187254]
[1091176,null,"ITALO SIFUENTES ALEMÁN","ISIFUENTES@SIS.GOB.PE",4.01,20187254]
[1091178,null,"MISOLINO PORRAS BALVÍN","MPORRAS@SIS.GOB.PE","04.02.01",20187254]
[1091179,null,"LUZ ELENA BASURTO YAMANI","LBASURTO@SIS.GOB.PE","04.02.02",20187254]
[1091180,null,"PEDRO ANTONIO PERALES ORDOÑEZ","APERALES@SIS.GOB.PE","04.02.03",20187254]
[1091181,null,"NELLY LOPEZ VARGAS","NLOPEZ@SIS.GOB.PE","04.02.04",20187254]
[1091182,null,"GLADYS JIBAJA CASTILLO","GJIBAJA@SIS.GOB.PE","04.02.05",20187254]
[1091183,null,"ROSA LEÓN LAOS","RLEON@SIS.GOB.PE",4.03,20187254]
[1091184,null,"EDWIN LEZAMA ROMERO","ELEZAMA@SIS.GOB.PE",5.01,20187254]
[1091185,null,"GINA BARCENA LUZA","GBARCENA@SIS.GOB.PE",5.0199999999999996,20187254]
[1091186,null,"CESAR GILMALCA PALACIOS","CGIMALCA@SIS.GOB.PE",5.03,20187254]
[1091188,"GMR NORTE","FERNANDO AUGUSTO CHANG GASCO","FCHANG@SIS.GOB.PE",6.01]
{"$rows_left_out":76}
{"sheet":"Hoja2","index":8,"n_rows":22,"n_cols":8,"rows_kept":22,"cut":false,"hidden":true,"merged":[]}
[]
["N°","Exp","Documento","Concepto","Detalle","Monto","C. C.","Respuesta"]
[1,"18-085464-001","Memorando N° 692-2018-SIS-SG","Servicio de terceros",null,6000,"SG"]
[2,"18-084567-001","Memorando N° 612-2018-SIS-GA\nInforme N° 30-2018-SIS/GA (18-092864-003)","Servicio de terceros","Aló SIS",60000,"GA","Inf Conjunto 009"]
[3,"18-076669-001","Nota Inf N° 431-2018-SIS-GMR NOR-UDR LLIB","Servicio de terceros","Auditor Médico",6500,"UDR LA LIB","Inf 10"]
[4,"18-076989-001","Memorando N° 525-2018-SIS-GMR SUR","Servicio de terceros","Médico Evaluador",15000,"GMR SUR","Inf 10"]
[5,"18-082403-001","Memorando N° 231-2018-SIS-OGIIT",null,"Post produccion para contenido educativo",5000,"OGIIT"]
[6,"18-074930-001","Nota Inf N° 005-2018-SIS-COM.INV.B.P","Servicio de terceros","Inventario Patrimonial",78000,"ABAST"]
[7,"18-083630-001","Nota Inf N° 161-2018-SIS-OGAR-OA","Servicio de terceros","Inventario Patrimonial",9000,"ABAST"]
[8,"18-082197-001","Nota Inf N° 814-2018-SIS-OGAR-OGRH","Servicio de terceros","Seguridad y salud en el trabajo",16000,"OGGRH","Inf Conjunto 008"]
[9,"18-070157-001","Nota Inf N° 737-2018-SIS-OGAR-OGRH","Servicio de terceros","Sistema de Desplazamiento de Personal",16500,"OGGRH","Inf Conjunto 008"]
[10,"18-052955-001","Nota Inf N° 618-2018-SIS-OGAR-OGRH","Servicio de terceros","Clasificación de archivos en RH",1800,"OGGRH","Inf Conjunto 008"]
[11,"18-093128-001","Inf N° 070-2018-SIS/OGIT-UTI-MMR","Licencia de sotfware","Antivirus",null,"OGTI"]
[12,"18-086174-001","Inf N° 057-2018-SIS/OGTI-UTI-US/EMS","Servicio de terceros","Diagnóstico situacional de Reglas de consistencia y validación",null,"OGTI"]
[13,"18-091380-001","Inf N° 031-2018-SIS/OGTI-VBC","Servicio de terceros","Optimización de opeaciones en el SIS independiente (afiliacion SIASIS)",null,"OGTI"]
{"$rows_left_out":8}
{"sheet":"Hoja3","index":9,"n_rows":19,"n_cols":5,"rows_kept":19,"cut":false,"hidden":true,"merged":[[3,1,3,2]]}
[]
[]
[]
[null,"SEGURO INTEGRAL DE SALUD}",null,{"$f":"+D5+D8+D11+D15","v":2278034936},"%"]
[null,"OEI 1","Incrementar la cobertura de la población objetivo del SIS.",{"$f":"SUM(D6:D7)","v":2231862},{"$f":"+D5/($D$5+$D$8+$D$11+$D$15)","v":9.7973124324376038E-4}]
[null,"AEI 1.1","Afiliación al SIS incrementada en la población objetivo.",696645,{"$f":"+D6/$D$5","v":0.31213623422953568}]
[null,"AEI 1.2","Mecanismos de protección de derechos optimizados",1535217,{"$f":"+D7/$D$5","v":0.68786376577046426}]
[null,"OEI 2","Reducir los riesgos técnicos y financieros",{"$f":"SUM(D9:D10)","v":4021186},{"$f":"+D8/($D$5+$D$8+$D$11+$D$15)","v":1.765199442929E-3}]
[null,"AEI 2.1","Control técnico y financiero",2665324,{"$f":"+D9/$D$8","v":0.66282037190023047}]
[null,"AEI 2.2","Auditoria médica y financiera optimizada",1355862,{"$f":"+D10/$D$8","v":0.33717962809976959}]
[null,"OEI 3","Mejorar la gestión del financiamiento de las prestaciones",{"$f":"SUM(D12:D14)","v":2178404134},{"$f":"+D11/($D$5+$D$8+$D$11+$D$15)","v":0.95626458557525829}]
[null,"AEI 3.1","Financiamiento del SIS incrementado por RDR",137610,{"$f":"+D12/$D$11","v":6.3170096793435483E-5}]
[null,"AEI 3.2","Recursos del SIS transferidos para reposición",2001410024,{"$f":"+D13/$D$11","v":0.91875056274567279}]
[null,"AEI 3.3","Mecanismos de compra de servicios optimizados",176856500,8.118626715753377E-2]
[null,"OEI 4","Mejorar la eficacia y eficiencia de los procesos de gestión institucional.",{"$f":"SUM(D16:D19)","v":93377754},{"$f":"+D15/($D$5+$D$8+$D$11+$D$15)","v":4.0990483738568971E-2}]
{"$rows_left_out":5}
{"sheet":"Flujo Form","index":10,"n_rows":49,"n_cols":9,"rows_kept":49,"cut":false,"hidden":true,"merged":[[0,3,0,8]]}
[null,null,null,"FLUJOGRAMA DEL PROCESO DEL PLANEAMIENTO OPERATIVO: Formulación y modificación del POI"]
[]
[null,null,null,1,null,2]
[]
[null,null,null,"OGPPDO","Comisión OGPPDO","Unidaes Orgánicas","OGAJ","JEFATURA","OGIIT"]
{"$rows_empty":26}
[null,"Formulacion"]
[null,"Modificación"]
[]
[1,"Inicio"]
[2,"Actualiza AOE"]
[3,"Revisa AOE"]
[4,"Esta Ok?"]
[5,"Registra AOE en CEPLAN"]
[6,"Comunica a UO"]
{"$rows_left_out":10}
{"sheet":"Flujo Eval","index":11,"n_rows":20,"n_cols":7,"rows_kept":20,"cut":false,"hidden":true,"merged":[[2,3,2,6]]}
[]
[null,null,null,1,2]
[null,null,null,"FLUJOGRAMA DEL PROCESO DEL PLANEAMIENTO OPERATIVO: Seguimiento y Evaluación del POI"]
[null,null,null,"OGPPDO","UNIDADES ORGANICAS","SECRETARIA GENERAL","OGIIT"]
[]
[null,"Seguimiento"]
[null,"Evaluación"]
[1,"Inicio"]
[2,"Apertura CEPLAN para el registro de avance de MF"]
[3,"Comunica a UO el inicio de registro seguimiento en CEPLAN"]
[4,"Registra avance mensual de MF en CEPLAN"]
[5,"Comunica a OGPPDO el registro en CEPLAN"]
[6,"Elabora el Informe Cualitativo"]
[7,"Evalua los registros de UO en CEPLAN"]
[8,"Está Conforme?"]
{"$rows_left_out":6}
{"sheet":"Hoja4","index":12,"n_rows":250,"n_cols":5,"rows_kept":250,"cut":false,"hidden":true,"merged":[]}
[]
[]
[null,null,null,"CODIGO","SI"]
[null,null,null,"18AO110921692","SI"]
[null,null,null,"18AO110920381","SI"]
[null,null,null,"18AO111149643","SI"]
[null,null,null,"18AO110921680","SI"]
[null,null,null,"18AO111142739","SI"]
[null,null,null,"18AO111141933","SI"]
[null,null,null,"18AO111141936","SI"]
[null,null,null,"18AO111141939","SI"]
[null,null,null,"18AO111142899","SI"]
[null,null,null,"18AO110920388","SI"]
[null,null,null,"18AO110920392","SI"]
[null,null,null,"18AO111142901","SI"]
{"$rows_left_out":235}